Reaction Details
TargetGABA-A receptor; alpha-2/beta-3/gamma-2
LigandBDBM50144861
Substrate/Competitorn/a
Meas. Tech.ChEMBL_70250 (CHEMBL682709)
Ki 2.7±n/a nM
Citation Street, LJSternfeld, FJelley, RAReeve, AJCarling, RWMoore, KWMcKernan, RMSohal, BCook, SPike, ADawson, GRBromidge, FAWafford, KASeabrook, GRThompson, SAMarshall, GPillai, GVCastro, JLAtack, JRMacLeod, AM Synthesis and biological evaluation of 3-heterocyclyl-7,8,9,10-tetrahydro-(7,10-ethano)-1,2,4-triazolo[3,4-a]phthalazines and analogues as subtype-selective inverse agonists for the GABA(A)alpha5 benzodiazepine binding site. J Med Chem47:3642-57 (2004) 
 
GABA-A receptor; alpha-2/beta-3/gamma-2
Name:GABA-A receptor; alpha-2/beta-3/gamma-2
Type:n/a
Mol. Mass.:n/a
Description:ASSAY_ID of ChEMBL is 2148174
Components:This complex has 3 components.
Component 1
Name:Gamma-aminobutyric acid receptor subunit gamma-2
Synonyms:GABA(A) receptor subunit gamma-2 GBRG2_HUMAN
Type:PROTEIN
Mol. Mass.:54172.74
Organism:Homo sapiens (Human)
Description:EBI_217
Residue:467
Component 2
Name:Gamma-aminobutyric acid receptor subunit beta-3
Synonyms:GABA A receptor alpha-4/beta-3/gamma-2 GABA-A receptor GBRB3_HUMAN | agonist GABA site
Type:PROTEIN
Mol. Mass.:54130.51
Organism:Homo sapiens (Human)
Description:ChEMBL_448071
Residue:473
Component 3
Name:Gamma-aminobutyric acid receptor subunit alpha-2
Synonyms:GABA receptor alpha-2 subunit GBRA2_HUMAN | Gamma-aminobutyric acid receptor subunit alpha-2 (GABRA2)
Type:Protein
Mol. Mass.:51338.78
Organism:Homo sapiens (Human)
Description:P47869
Residue:451
BDBM50144861
NameBDBM50144861
Synonyms:3-(5-Methyl-isoxazol-3-yl)-6-(pyridin-2-ylmethoxy)-[1,2,4]triazolo[3,4-a]phthalazine CHEMBL68684
TypeSmall organic molecule
Emp. Form.C19H14N6O2
Mol. Mass.358.3535
SMILESCc1cc(no1)-c1nnc2c3ccccc3c(OCc3ccccn3)nn12