Reaction Details
TargetBeta-lactamase
LigandBDBM50053173
Substrate/Competitorn/a
Meas. Tech.ChEMBL_41200 (CHEMBL653466)
IC50 30±0 nM
Citation Tabei, KFeng, XVenkatesan, AMAbe, THideki, UMansour, TSSiegel, MM Mechanism of inactivation of beta-lactamases by novel 6-methylidene penems elucidated using electrospray ionization mass spectrometry. J Med Chem47:3674-88 (2004) 
 
Beta-lactamase
Name:Beta-lactamase
Synonyms:IMI-1
Type:PROTEIN
Mol. Mass.:32022.80
Organism:Enterobacter cloacae
Description:ChEMBL_522057
Residue:292
BDBM50053173
NameBDBM50053173
TypeSmall organic molecule
Emp. Form.C10H12N4O5S
Mol. Mass.300.291
SMILESC[C@]1(Cn2ccnn2)[C@@H](N2[C@@H](CC2=O)S1(=O)=O)C(O)=O