Reaction Details
TargetBeta-lactamase TEM
LigandBDBM50149466
Substrate/Competitorn/a
Meas. Tech.ChEMBL_41201 (CHEMBL876650)
IC50 1±0 nM
Citation Tabei, KFeng, XVenkatesan, AMAbe, THideki, UMansour, TSSiegel, MM Mechanism of inactivation of beta-lactamases by novel 6-methylidene penems elucidated using electrospray ionization mass spectrometry. J Med Chem47:3674-88 (2004) 
 
Beta-lactamase TEM
Name:Beta-lactamase TEM
Type:Enzyme
Mol. Mass.:31512.33
Organism:Escherichia coli
Description:P62593
Residue:286
BDBM50149466
NameBDBM50149466
Synonyms:CHEMBL124416 | Sodium; (R)-6-[1-(5,6-dihydro-4H-pyrrolo[1,2-b]pyrazol-2-yl)-meth-(Z)-ylidene]-7-oxo-4-thia-1-aza-bicyclo[3.2.0]hept-2-ene-2-carboxylate
TypeSmall organic molecule
Emp. Form.C13H10N3O3S
Mol. Mass.288.302
SMILES[O-]C(=O)C1=CS[C@H]2N1C(=O)\C2=C\c1cc2CCCn2n1