Reaction Details
TargetEstrogen receptor
LigandBDBM50149484
Substrate/Competitorn/a
Meas. Tech.ChEMBL_304574 (CHEMBL831071)
IC50 0.60±n/a nM
Citation Blizzard, TADiNinno, FMorgan, JDChen, HYWu, JYGude, CKim, SChan, WBirzin, ETTien Yang, YPai, LYZhang, ZHayes, ECDaSilva, CATang, WRohrer, SPSchaeffer, JMHammond, ML Estrogen receptor ligands. Part 7: Dihydrobenzoxathiin SERAMs with bicyclic amine side chains. Bioorg Med Chem Lett14:3861-4 (2004) 
 
Estrogen receptor
Name:Estrogen receptor
Type:Protein
Mol. Mass.:66230.44
Organism:Homo sapiens (Human)
Description:P03372
Residue:595
BDBM50149484
NameBDBM50149484
Synonyms:(2S,3R)-2-{4-[2-(4-Aza-tricyclo[4.3.1.1*3,8*]undec-4-yl)-ethoxy]-phenyl}-3-(4-hydroxy-phenyl)-2,3-dihydro-benzo[1,4]oxathiin-6-ol | CHEMBL184371
TypeSmall organic molecule
Emp. Form.C32H35NO4S
Mol. Mass.529.69
SMILESOc1ccc(cc1)[C@H]1Sc2cc(O)ccc2O[C@H]1c1ccc(OCCN2CC3CC4CC(C3)CC2C4)cc1