Reaction Details
TargetEstrogen receptor beta
LigandBDBM50149485
Substrate/Competitorn/a
Meas. Tech.ChEMBL_304572 (CHEMBL831070)
IC50 33±n/a nM
Citation Blizzard, TADiNinno, FMorgan, JDChen, HYWu, JYGude, CKim, SChan, WBirzin, ETTien Yang, YPai, LYZhang, ZHayes, ECDaSilva, CATang, WRohrer, SPSchaeffer, JMHammond, ML Estrogen receptor ligands. Part 7: Dihydrobenzoxathiin SERAMs with bicyclic amine side chains. Bioorg Med Chem Lett14:3861-4 (2004) 
 
Estrogen receptor beta
Name:Estrogen receptor beta
Type:Protein
Mol. Mass.:59238.43
Organism:Homo sapiens (Human)
Description:Q92731
Residue:530
BDBM50149485
NameBDBM50149485
Synonyms:(2S,3R)-3-(4-Hydroxy-phenyl)-2-{4-[(6R,7S)-2-(octahydro-isoindol-2-yl)-ethoxy]-phenyl}-2,3-dihydro-benzo[1,4]oxathiin-6-ol | CHEMBL185231
TypeSmall organic molecule
Emp. Form.C30H33NO4S
Mol. Mass.503.652
SMILESOc1ccc(cc1)[C@H]1Sc2cc(O)ccc2O[C@H]1c1ccc(OCCN2C[C@H]3CCCC[C@H]3C2)cc1