Reaction Details
TargetMethionine--tRNA ligase
LigandBDBM50149641
Substrate/Competitorn/a
Meas. Tech.ChEMBL_305245 (CHEMBL833503)
IC50 38±n/a nM
Citation Jarvest, RLArmstrong, SABerge, JMBrown, PElder, JSBrown, MJCopley, RCForrest, AKHamprecht, DWO'Hanlon, PJMitchell, DJRittenhouse, SWitty, DR Definition of the heterocyclic pharmacophore of bacterial methionyl tRNA synthetase inhibitors: potent antibacterially active non-quinolone analogues. Bioorg Med Chem Lett14:3937-41 (2004) 
 
Methionine--tRNA ligase
Name:Methionine--tRNA ligase
Type:PROTEIN
Mol. Mass.:74852.92
Organism:Staphylococcus aureus (strain MW2)
Description:ChEMBL_305245
Residue:657
BDBM50149641
NameBDBM50149641
Synonyms:2-[3-(3,4-Dichloro-benzylamino)-propoxy]-1H-quinolin-4-one | CHEMBL368690
TypeSmall organic molecule
Emp. Form.C19H18Cl2N2O2
Mol. Mass.377.264
SMILESOc1cc(OCCCNCc2ccc(Cl)c(Cl)c2)nc2ccccc12