Reaction Details
TargetMethionine--tRNA ligase
LigandBDBM50149650
Substrate/Competitorn/a
Meas. Tech.ChEMBL_305245 (CHEMBL833503)
IC50 3.9±n/a nM
Citation Jarvest, RLArmstrong, SABerge, JMBrown, PElder, JSBrown, MJCopley, RCForrest, AKHamprecht, DWO'Hanlon, PJMitchell, DJRittenhouse, SWitty, DR Definition of the heterocyclic pharmacophore of bacterial methionyl tRNA synthetase inhibitors: potent antibacterially active non-quinolone analogues. Bioorg Med Chem Lett14:3937-41 (2004) 
 
Methionine--tRNA ligase
Name:Methionine--tRNA ligase
Type:PROTEIN
Mol. Mass.:74852.92
Organism:Staphylococcus aureus (strain MW2)
Description:ChEMBL_305245
Residue:657
BDBM50149650
NameBDBM50149650
Synonyms:2-[3-(3,5-Dibromo-benzylamino)-propylamino]-1H-thieno[3,2-d]pyrimidin-4-one | CHEMBL359928
TypeSmall organic molecule
Emp. Form.C16H16Br2N4OS
Mol. Mass.472.197
SMILESBrc1cc(Br)cc(CNCCCNc2nc3ccsc3c(=O)[nH]2)c1