Reaction Details
TargetMethionine--tRNA ligase
LigandBDBM50409933
Substrate/Competitorn/a
Meas. Tech.ChEMBL_305245 (CHEMBL833503)
IC50 6.3±n/a nM
Citation Jarvest, RLArmstrong, SABerge, JMBrown, PElder, JSBrown, MJCopley, RCForrest, AKHamprecht, DWO'Hanlon, PJMitchell, DJRittenhouse, SWitty, DR Definition of the heterocyclic pharmacophore of bacterial methionyl tRNA synthetase inhibitors: potent antibacterially active non-quinolone analogues. Bioorg Med Chem Lett14:3937-41 (2004) 
 
Methionine--tRNA ligase
Name:Methionine--tRNA ligase
Type:PROTEIN
Mol. Mass.:74852.92
Organism:Staphylococcus aureus (strain MW2)
Description:ChEMBL_305245
Residue:657
BDBM50409933
NameBDBM50409933
Synonyms:CHEMBL2096779
TypeSmall organic molecule
Emp. Form.C18H20Br2N6
Mol. Mass.480.2
SMILESBrc1cc(Br)c2NCC[C@@H](NCCCNc3nc4ncccc4[nH]3)c2c1