Reaction Details
TargetBeta-lactamase
LigandBDBM50149784
Substrate/Competitorn/a
Meas. Tech.ChEMBL_302784 (CHEMBL839469)
Ki 450±n/a nM
Citation Buzzoni, VBlazquez, JFerrari, SCalò, SVenturelli, ACosti, MP Aza-boronic acids as non-beta-lactam inhibitors of AmpC-beta-lactamase. Bioorg Med Chem Lett14:3979-83 (2004) 
 
Beta-lactamase
Name:Beta-lactamase
Type:Protien
Mol. Mass.:41561.62
Organism:Escherichia coli
Description:P00811
Residue:377
BDBM50149784
NameBDBM50149784
Synonyms:Aza-boronic acid derivative | CHEMBL180679
TypeSmall organic molecule
Emp. Form.C16H13BN2O4
Mol. Mass.308.096
SMILESOB(O)c1cccc(c1)N=Nc1c(O)cc(O)c2ccccc12