Reaction Details
TargetMetabotropic glutamate receptor 5
LigandBDBM50149803
Substrate/Competitorn/a
Meas. Tech.ChEMBL_303098 (CHEMBL876376)
Ki 638±n/a nM
Citation Roppe, JRWang, BHuang, DTehrani, LKamenecka, TSchweiger, EJAnderson, JJBrodkin, JJiang, XCramer, MChung, JReyes-Manalo, GMunoz, BCosford, ND 5-[(2-Methyl-1,3-thiazol-4-yl)ethynyl]-2,3'-bipyridine: a highly potent, orally active metabotropic glutamate subtype 5 (mGlu5) receptor antagonist with anxiolytic activity. Bioorg Med Chem Lett14:3993-6 (2004) 
 
Metabotropic glutamate receptor 5
Name:Metabotropic glutamate receptor 5
Type:Enzyme
Mol. Mass.:131900.14
Organism:Rattus norvegicus (Rat)
Description:P31424
Residue:1203
BDBM50149803
NameBDBM50149803
Synonyms:2-Methyl-4-p-tolylethynyl-thiazole | CHEMBL185813
TypeSmall organic molecule
Emp. Form.C13H11NS
Mol. Mass.213.298
SMILESCc1nc(cs1)C#Cc1ccc(C)cc1