Reaction Details
TargetMetabotropic glutamate receptor 5
LigandBDBM50122757
Substrate/Competitorn/a
Meas. Tech.ChEMBL_303098 (CHEMBL876376)
Ki 54±n/a nM
Citation Roppe, JRWang, BHuang, DTehrani, LKamenecka, TSchweiger, EJAnderson, JJBrodkin, JJiang, XCramer, MChung, JReyes-Manalo, GMunoz, BCosford, ND 5-[(2-Methyl-1,3-thiazol-4-yl)ethynyl]-2,3'-bipyridine: a highly potent, orally active metabotropic glutamate subtype 5 (mGlu5) receptor antagonist with anxiolytic activity. Bioorg Med Chem Lett14:3993-6 (2004) 
 
Metabotropic glutamate receptor 5
Name:Metabotropic glutamate receptor 5
Type:Enzyme
Mol. Mass.:131900.14
Organism:Rattus norvegicus (Rat)
Description:P31424
Residue:1203
BDBM50122757
NameBDBM50122757
Synonyms:2-(2-Methyl-thiazol-4-ylethynyl)-pyridine | CHEMBL65022
TypeSmall organic molecule
Emp. Form.C11H8N2S
Mol. Mass.200.26
SMILESCc1nc(cs1)C#Cc1ccccn1