Reaction Details
TargetMetabotropic glutamate receptor 5
LigandBDBM50149792
Substrate/Competitorn/a
Meas. Tech.ChEMBL_303098 (CHEMBL876376)
Ki 1±n/a nM
Citation Roppe, JRWang, BHuang, DTehrani, LKamenecka, TSchweiger, EJAnderson, JJBrodkin, JJiang, XCramer, MChung, JReyes-Manalo, GMunoz, BCosford, ND 5-[(2-Methyl-1,3-thiazol-4-yl)ethynyl]-2,3'-bipyridine: a highly potent, orally active metabotropic glutamate subtype 5 (mGlu5) receptor antagonist with anxiolytic activity. Bioorg Med Chem Lett14:3993-6 (2004) 
 
Metabotropic glutamate receptor 5
Name:Metabotropic glutamate receptor 5
Type:Enzyme
Mol. Mass.:131900.14
Organism:Rattus norvegicus (Rat)
Description:P31424
Residue:1203
BDBM50149792
NameBDBM50149792
Synonyms:5-(2-Methyl-thiazol-4-ylethynyl)-[3,3'']bipyridinyl | CHEMBL183864
TypeSmall organic molecule
Emp. Form.C16H11N3S
Mol. Mass.277.344
SMILESCc1nc(cs1)C#Cc1cncc(c1)-c1cccnc1