Reaction Details
TargetLysophosphatidic acid receptor 3
LigandBDBM50150007
Substrate/Competitorn/a
Meas. Tech.ChEMBL_304755 (CHEMBL829353)
Ki 48±n/a nM
Citation Heasley, BHJarosz, RCarter, KMVan, SJLynch, KRMacdonald, TL A novel series of 2-pyridyl-containing compounds as lysophosphatidic acid receptor antagonists: development of a nonhydrolyzable LPA3 receptor-selective antagonist. Bioorg Med Chem Lett14:4069-74 (2004) 
 
Lysophosphatidic acid receptor 3
Name:Lysophosphatidic acid receptor 3
Type:Enzyme
Mol. Mass.:40149.72
Organism:Homo sapiens (Human)
Description:Q9UBY5
Residue:353
BDBM50150007
NameBDBM50150007
Synonyms:CHEMBL183221 | Phosphoric acid mono-((R)-2-((Z)-octadec-9-enoylamino)-3-{4-[4-(2,2,2-trifluoro-ethoxy)-pyridin-2-ylmethoxy]-phenyl}-propyl) ester
TypeSmall organic molecule
Emp. Form.C35H52F3N2O7P
Mol. Mass.700.7656
SMILESCCCCCCCC\C=C/CCCCCCCC(=O)N[C@@H](COP(O)(O)=O)Cc1ccc(OCc2cc(OCC(F)(F)F)ccn2)cc1