Reaction Details
TargetGag-Pol polyprotein [489-587]
LigandBDBM192
Substrate/Competitorn/a
Meas. Tech.ChEMBL_310123 (CHEMBL838105)
EC50 10±n/a nM
Citation Huang, PPRandolph, JTKlein, LLVasavanonda, SDekhtyar, TStoll, VSKempf, DJ Synthesis and antiviral activity of P1' arylsulfonamide azacyclic urea HIV protease inhibitors. Bioorg Med Chem Lett14:4075-8 (2004) 
 
Gag-Pol polyprotein [489-587]
Name:Gag-Pol polyprotein [489-587]
Type:Enzyme Subunit
Mol. Mass.:10781.16
Organism:Human immunodeficiency virus type 1
Description:P04585[489-587]
Residue:99
BDBM192
NameBDBM192
Synonyms:(5R,6R)-1,5-dibenzyl-6-hydroxy-2,4-bis[(4-hydroxyphenyl)methyl]-1,2,4-triazepan-3-one CHEMBL130078 | Unnamed azacyclic urea
Typen/a
Emp. Form.C32H33N3O4
Mol. Mass.523.6221
SMILESO[C@@H]1CN(Cc2ccccc2)N(Cc2ccc(O)cc2)C(=O)N(Cc2ccc(O)cc2)[C@@H]1Cc1ccccc1