Reaction Details
TargetSodium-dependent serotonin transporter
LigandBDBM50150079
Substrate/Competitorn/a
Meas. Tech.ChEMBL_201813 (CHEMBL805321)
Ki 19.5±n/a nM
Citation Mewshaw, REZhou, DZhou, PShi, XHornby, GSpangler, TScerni, RSmith, DSchechter, LEAndree, TH Studies toward the discovery of the next generation of antidepressants. 3. Dual 5-HT1A and serotonin transporter affinity within a class of N-aryloxyethylindolylalkylamines. J Med Chem47:3823-42 (2004) 
 
Sodium-dependent serotonin transporter
Name:Sodium-dependent serotonin transporter
Type:Multi-pass membrane protein
Mol. Mass.:70168.43
Organism:Rattus norvegicus (rat)
Description:P31652
Residue:630
BDBM50150079
NameBDBM50150079
Synonyms:CHEMBL338587 | [4-(1H-Indol-3-yl)-butyl]-[2-(1H-indol-4-yloxy)-ethyl]-amine
TypeSmall organic molecule
Emp. Form.C22H25N3O
Mol. Mass.347.4534
SMILESC(CCc1c[nH]c2ccccc12)CNCCOc1cccc2[nH]ccc12