Reaction Details
TargetSodium-dependent serotonin transporter
LigandBDBM50150085
Substrate/Competitorn/a
Meas. Tech.ChEMBL_201813 (CHEMBL805321)
Ki 2±n/a nM
Citation Mewshaw, REZhou, DZhou, PShi, XHornby, GSpangler, TScerni, RSmith, DSchechter, LEAndree, TH Studies toward the discovery of the next generation of antidepressants. 3. Dual 5-HT1A and serotonin transporter affinity within a class of N-aryloxyethylindolylalkylamines. J Med Chem47:3823-42 (2004) 
 
Sodium-dependent serotonin transporter
Name:Sodium-dependent serotonin transporter
Type:Multi-pass membrane protein
Mol. Mass.:70168.43
Organism:Rattus norvegicus (rat)
Description:P31652
Residue:630
BDBM50150085
NameBDBM50150085
Synonyms:CHEMBL126424 | [3-(5-Fluoro-1H-indol-3-yl)-propyl]-[2-(1H-indol-4-yloxy)-ethyl]-amine
TypeSmall organic molecule
Emp. Form.C21H22FN3O
Mol. Mass.351.4173
SMILESFc1ccc2[nH]cc(CCCNCCOc3cccc4[nH]ccc34)c2c1