Reaction Details
TargetSodium-dependent serotonin transporter
LigandBDBM50150099
Substrate/Competitorn/a
Meas. Tech.ChEMBL_201349 (CHEMBL806211)
IC50 24.6±n/a nM
Citation Mewshaw, REZhou, DZhou, PShi, XHornby, GSpangler, TScerni, RSmith, DSchechter, LEAndree, TH Studies toward the discovery of the next generation of antidepressants. 3. Dual 5-HT1A and serotonin transporter affinity within a class of N-aryloxyethylindolylalkylamines. J Med Chem47:3823-42 (2004) 
 
Sodium-dependent serotonin transporter
Name:Sodium-dependent serotonin transporter
Type:Multi-pass membrane protein
Mol. Mass.:70322.51
Organism:Homo sapiens (Human)
Description:P31645
Residue:630
BDBM50150099
NameBDBM50150099
Synonyms:CHEMBL339490 | [2-(7-Fluoro-2,3-dihydro-benzo[1,4]dioxin-5-yloxy)-ethyl]-[3-(5-fluoro-1H-indol-3-yl)-propyl]-amine
TypeSmall organic molecule
Emp. Form.C21H22F2N2O3
Mol. Mass.388.4078
SMILESFc1ccc2[nH]cc(CCCNCCOc3cc(F)cc4OCCOc34)c2c1