Reaction Details
Target5-hydroxytryptamine receptor 1A
LigandBDBM50150084
Substrate/Competitorn/a
Meas. Tech.ChEMBL_904 (CHEMBL615753)
Ki 5.8±n/a nM
Citation Mewshaw, REZhou, DZhou, PShi, XHornby, GSpangler, TScerni, RSmith, DSchechter, LEAndree, TH Studies toward the discovery of the next generation of antidepressants. 3. Dual 5-HT1A and serotonin transporter affinity within a class of N-aryloxyethylindolylalkylamines. J Med Chem47:3823-42 (2004) 
 
5-hydroxytryptamine receptor 1A
Name:5-hydroxytryptamine receptor 1A
Type:n/a
Mol. Mass.:46122.49
Organism:Homo sapiens (Human)
Description:n/a
Residue:422
BDBM50150084
NameBDBM50150084
Synonyms:CHEMBL124700 | [2-(2,3-Dihydro-benzo[1,4]dioxin-5-yloxy)-ethyl]-[2-(5-fluoro-1H-indol-3-yl)-ethyl]-amine
TypeSmall organic molecule
Emp. Form.C20H21FN2O3
Mol. Mass.356.3907
SMILESFc1ccc2[nH]cc(CCNCCOc3cccc4OCCOc34)c2c1