Reaction Details
Target5-hydroxytryptamine receptor 1A
LigandBDBM50150098
Substrate/Competitorn/a
Meas. Tech.ChEMBL_904 (CHEMBL615753)
Ki 1.6±n/a nM
Citation Mewshaw, REZhou, DZhou, PShi, XHornby, GSpangler, TScerni, RSmith, DSchechter, LEAndree, TH Studies toward the discovery of the next generation of antidepressants. 3. Dual 5-HT1A and serotonin transporter affinity within a class of N-aryloxyethylindolylalkylamines. J Med Chem47:3823-42 (2004) 
 
5-hydroxytryptamine receptor 1A
Name:5-hydroxytryptamine receptor 1A
Type:n/a
Mol. Mass.:46122.49
Organism:Homo sapiens (Human)
Description:n/a
Residue:422
BDBM50150098
NameBDBM50150098
Synonyms:CHEMBL126407 | [2-(Benzofuran-7-yloxy)-ethyl]-[3-(5-fluoro-1H-indol-3-yl)-propyl]-amine
TypeSmall organic molecule
Emp. Form.C21H21FN2O2
Mol. Mass.352.402
SMILESFc1ccc2[nH]cc(CCCNCCOc3cccc4ccoc34)c2c1