Reaction Details
TargetSodium-dependent serotonin transporter
LigandBDBM50150105
Substrate/Competitorn/a
Meas. Tech.ChEMBL_201813 (CHEMBL805321)
Ki 0.47±n/a nM
Citation Mewshaw, REZhou, DZhou, PShi, XHornby, GSpangler, TScerni, RSmith, DSchechter, LEAndree, TH Studies toward the discovery of the next generation of antidepressants. 3. Dual 5-HT1A and serotonin transporter affinity within a class of N-aryloxyethylindolylalkylamines. J Med Chem47:3823-42 (2004) 
 
Sodium-dependent serotonin transporter
Name:Sodium-dependent serotonin transporter
Type:Multi-pass membrane protein
Mol. Mass.:70168.43
Organism:Rattus norvegicus (rat)
Description:P31652
Residue:630
BDBM50150105
NameBDBM50150105
Synonyms:CHEMBL124069 | [2-(6-Fluoro-chroman-8-yloxy)-ethyl]-[3-(5-fluoro-1H-indol-3-yl)-propyl]-amine
TypeSmall organic molecule
Emp. Form.C22H24F2N2O2
Mol. Mass.386.435
SMILESFc1cc2CCCOc2c(OCCNCCCc2c[nH]c3ccc(F)cc23)c1