Reaction Details
Target5-hydroxytryptamine receptor 1A
LigandBDBM50150087
Substrate/Competitorn/a
Meas. Tech.ChEMBL_904 (CHEMBL615753)
Ki 35.1±n/a nM
Citation Mewshaw, REZhou, DZhou, PShi, XHornby, GSpangler, TScerni, RSmith, DSchechter, LEAndree, TH Studies toward the discovery of the next generation of antidepressants. 3. Dual 5-HT1A and serotonin transporter affinity within a class of N-aryloxyethylindolylalkylamines. J Med Chem47:3823-42 (2004) 
 
5-hydroxytryptamine receptor 1A
Name:5-hydroxytryptamine receptor 1A
Type:n/a
Mol. Mass.:46122.49
Organism:Homo sapiens (Human)
Description:n/a
Residue:422
BDBM50150087
NameBDBM50150087
Synonyms:CHEMBL435612 | [2-(5-Fluoro-2,3-dihydro-benzofuran-7-yloxy)-ethyl]-[2-(5-fluoro-1H-indol-3-yl)-ethyl]-amine
TypeSmall organic molecule
Emp. Form.C20H20F2N2O2
Mol. Mass.358.3818
SMILESFc1ccc2[nH]cc(CCNCCOc3cc(F)cc4CCOc34)c2c1