Reaction Details
TargetProthrombin
LigandBDBM50150297
Substrate/Competitorn/a
Meas. Tech.ChEMBL_302338 (CHEMBL828922)
Ki 0.5±n/a nM
Citation Morrissette, MMStauffer, KJWilliams, PDLyle, TAVacca, JPKrueger, JALewis, SDLucas, BJWong, BKWhite, RBMiller-Stein, CLyle, EAWallace, AALeonard, YMWelsh, DCLynch, JJMcMasters, DR Low molecular weight thrombin inhibitors with excellent potency, metabolic stability, and oral bioavailability. Bioorg Med Chem Lett14:4161-4 (2004) 
 
Prothrombin
Name:Prothrombin
Type:Protein
Mol. Mass.:70029.57
Organism:Homo sapiens (Human)
Description:P00734
Residue:622
BDBM50150297
NameBDBM50150297
Synonyms:(S)-1-(2-Hydroxy-acetyl)-pyrrolidine-2-carboxylic acid 2-aminomethyl-5-chloro-benzylamide | CHEMBL181550
TypeSmall organic molecule
Emp. Form.C15H20ClN3O3
Mol. Mass.325.791
SMILESNCc1ccc(Cl)cc1CNC(=O)[C@@H]1CCCN1C(=O)CO