Reaction Details
TargetPhenylethanolamine N-methyltransferase
LigandBDBM50081952
Substrate/Competitorn/a
Meas. Tech.ChEMBL_303166 (CHEMBL829978)
Ki 4.9±n/a nM
Citation Wu, QCriscione, KRGrunewald, GLMcLeish, MJ Phenylethanolamine N-methyltransferase inhibition: re-evaluation of kinetic data. Bioorg Med Chem Lett14:4217-20 (2004) 
 
Phenylethanolamine N-methyltransferase
Name:Phenylethanolamine N-methyltransferase
Type:Enzyme
Mol. Mass.:30852.66
Organism:Homo sapiens (Human)
Description:n/a
Residue:282
BDBM50081952
NameBDBM50081952
Synonyms:((R)-7-Bromo-1,2,3,4-tetrahydro-isoquinolin-3-yl)-methanol CHEMBL337144
TypeSmall organic molecule
Emp. Form.C10H12BrNO
Mol. Mass.242.112
SMILESOC[C@H]1Cc2ccc(Br)cc2CN1