Reaction Details
TargetRNA-directed RNA polymerase
LigandBDBM50150385
Substrate/Competitorn/a
Meas. Tech.ChEMBL_305746 (CHEMBL829418)
IC50 490±n/a nM
Citation Gopalsamy, ALim, KEllingboe, JWKrishnamurthy, GOrlowski, MFeld, Bvan Zeijl, MHowe, AY Identification of [(naphthalene-1-carbonyl)-amino]-acetic acid derivatives as nonnucleoside inhibitors of HCV NS5B RNA dependent RNA polymerase. Bioorg Med Chem Lett14:4221-4 (2004) 
 
RNA-directed RNA polymerase
Name:RNA-directed RNA polymerase
Type:Protein
Mol. Mass.:25173.95
Organism:Hepatitis C virus
Description:Q8JXU8
Residue:229
BDBM50150385
NameBDBM50150385
Synonyms:2-[(6-Methoxy-5-trifluoromethyl-naphthalene-1-carbonyl)-amino]-pentanedioic acid | CHEMBL184500
TypeSmall organic molecule
Emp. Form.C18H16F3NO6
Mol. Mass.399.3179
SMILESCOc1ccc2c(cccc2c1C(F)(F)F)C(=O)NC(CCC(O)=O)C(O)=O