Reaction Details
Target5-hydroxytryptamine receptor 7
LigandBDBM50150405
Substrate/Competitorn/a
Meas. Tech.ChEMBL_302553 (CHEMBL828254)
Ki 8±n/a nM
Citation Mattson, RJDenhart, DJCatt, JDDee, MFDeskus, JADitta, JLEpperson, JDalton King, HGao, APoss, MAPurandare, ATortolani, DZhao, YYang, HYeola, SPalmer, JTorrente, JStark, AJohnson, G Aminotriazine 5-HT7 antagonists. Bioorg Med Chem Lett14:4245-8 (2004) 
 
5-hydroxytryptamine receptor 7
Name:5-hydroxytryptamine receptor 7
Type:G Protein-Coupled Receptor (GPCR)
Mol. Mass.:53573.08
Organism:Homo sapiens (Human)
Description:P34969
Residue:479
BDBM50150405
NameBDBM50150405
Synonyms:CHEMBL182797 | N-(2-Phenoxy-ethyl)-N''-(1-phenyl-ethyl)-[1,3,5]triazine-2,4,6-triamine
TypeSmall organic molecule
Emp. Form.C19H22N6O
Mol. Mass.350.4176
SMILESCC(Nc1nc(N)nc(NCCOc2ccccc2)n1)c1ccccc1