Reaction Details
Target5-hydroxytryptamine receptor 2C
LigandBDBM50150407
Substrate/Competitorn/a
Meas. Tech.ChEMBL_302565 (CHEMBL839527)
Ki 10±n/a nM
Citation Mattson, RJDenhart, DJCatt, JDDee, MFDeskus, JADitta, JLEpperson, JDalton King, HGao, APoss, MAPurandare, ATortolani, DZhao, YYang, HYeola, SPalmer, JTorrente, JStark, AJohnson, G Aminotriazine 5-HT7 antagonists. Bioorg Med Chem Lett14:4245-8 (2004) 
 
5-hydroxytryptamine receptor 2C
Name:5-hydroxytryptamine receptor 2C
Type:G Protein-Coupled Receptor (GPCR)
Mol. Mass.:51836.79
Organism:Homo sapiens (Human)
Description:P28335
Residue:458
BDBM50150407
NameBDBM50150407
Synonyms:CHEMBL180086 | N-[1-(4-Fluoro-phenyl)-ethyl]-N''-(2-thiophen-2-yl-ethyl)-[1,3,5]triazine-2,4,6-triamine
TypeSmall organic molecule
Emp. Form.C17H19FN6S
Mol. Mass.358.436
SMILESCC(Nc1nc(N)nc(NCCc2cccs2)n1)c1ccc(F)cc1