Reaction Details
Target5-hydroxytryptamine receptor 7
LigandBDBM50150406
Substrate/Competitorn/a
Meas. Tech.ChEMBL_302553 (CHEMBL828254)
Ki 9±n/a nM
Citation Mattson, RJDenhart, DJCatt, JDDee, MFDeskus, JADitta, JLEpperson, JDalton King, HGao, APoss, MAPurandare, ATortolani, DZhao, YYang, HYeola, SPalmer, JTorrente, JStark, AJohnson, G Aminotriazine 5-HT7 antagonists. Bioorg Med Chem Lett14:4245-8 (2004) 
 
5-hydroxytryptamine receptor 7
Name:5-hydroxytryptamine receptor 7
Type:G Protein-Coupled Receptor (GPCR)
Mol. Mass.:53573.08
Organism:Homo sapiens (Human)
Description:P34969
Residue:479
BDBM50150406
NameBDBM50150406
Synonyms:CHEMBL182418 | N-[(S)-1-(4-Fluoro-phenyl)-ethyl]-N''-(2-pyridin-2-yl-ethyl)-[1,3,5]triazine-2,4,6-triamine
TypeSmall organic molecule
Emp. Form.C18H20FN7
Mol. Mass.353.3967
SMILESC[C@H](Nc1nc(N)nc(NCCc2ccccn2)n1)c1ccc(F)cc1