Reaction Details
Target5-hydroxytryptamine receptor 7
LigandBDBM50150416
Substrate/Competitorn/a
Meas. Tech.ChEMBL_302553 (CHEMBL828254)
Ki 60±n/a nM
Citation Mattson, RJDenhart, DJCatt, JDDee, MFDeskus, JADitta, JLEpperson, JDalton King, HGao, APoss, MAPurandare, ATortolani, DZhao, YYang, HYeola, SPalmer, JTorrente, JStark, AJohnson, G Aminotriazine 5-HT7 antagonists. Bioorg Med Chem Lett14:4245-8 (2004) 
 
5-hydroxytryptamine receptor 7
Name:5-hydroxytryptamine receptor 7
Type:G Protein-Coupled Receptor (GPCR)
Mol. Mass.:53573.08
Organism:Homo sapiens (Human)
Description:P34969
Residue:479
BDBM50150416
NameBDBM50150416
Synonyms:CHEMBL182121 | N-(1-Phenyl-ethyl)-N''-(3-phenyl-propyl)-[1,3,5]triazine-2,4,6-triamine
TypeSmall organic molecule
Emp. Form.C20H24N6
Mol. Mass.348.4448
SMILESCC(Nc1nc(N)nc(NCCCc2ccccc2)n1)c1ccccc1