Reaction Details
Target5-hydroxytryptamine receptor 7
LigandBDBM50150441
Substrate/Competitorn/a
Meas. Tech.ChEMBL_302554 (CHEMBL839517)
Ki 0.4±n/a nM
Citation Denhart, DJPurandare, AVCatt, JDKing, HDGao, ADeskus, JAPoss, MAStark, ADTorrente, JRJohnson, GMattson, RJ Diaminopyrimidine and diaminopyridine 5-HT7 ligands. Bioorg Med Chem Lett14:4249-52 (2004) 
 
5-hydroxytryptamine receptor 7
Name:5-hydroxytryptamine receptor 7
Type:G Protein-Coupled Receptor (GPCR)
Mol. Mass.:53573.08
Organism:Homo sapiens (Human)
Description:P34969
Residue:479
BDBM50150441
NameBDBM50150441
Synonyms:CHEMBL181605 | N*2*-[2-(4-Fluoro-phenyl)-ethyl]-N*4*-((S)-1-phenyl-ethyl)-pyridine-2,4-diamine
TypeSmall organic molecule
Emp. Form.C21H22FN3
Mol. Mass.335.4179
SMILESC[C@H](Nc1ccnc(NCCc2ccc(F)cc2)c1)c1ccccc1