Reaction Details
TargetD(2) dopamine receptor
LigandBDBM50150431
Substrate/Competitorn/a
Meas. Tech.ChEMBL_302295 (CHEMBL875190)
Ki 370±n/a nM
Citation Denhart, DJPurandare, AVCatt, JDKing, HDGao, ADeskus, JAPoss, MAStark, ADTorrente, JRJohnson, GMattson, RJ Diaminopyrimidine and diaminopyridine 5-HT7 ligands. Bioorg Med Chem Lett14:4249-52 (2004) 
 
D(2) dopamine receptor
Name:D(2) dopamine receptor
Type:Cell-surface receptors
Mol. Mass.:50647.10
Organism:Homo sapiens (Human)
Description:P14416
Residue:443
BDBM50150431
NameBDBM50150431
Synonyms:(S)-N2-(2-(4-fluorophenoxy)ethyl)-N4-(1-phenylethyl)pyridine-2,4-diamine N*2*-[2-(4-Fluoro-phenoxy)-ethyl]-N*4*-((S)-1-phenyl-ethyl)-pyridine-2,4-diamine
TypeSmall organic molecule
Emp. Form.C21H22FN3O
Mol. Mass.351.4173
SMILESC[C@H](Nc1ccnc(NCCOc2ccc(F)cc2)c1)c1ccccc1