Reaction Details
TargetSerine/threonine-protein kinase Chk1
LigandBDBM16591
Substrate/Competitorn/a
Meas. Tech.ChEMBL_306066 (CHEMBL833021)
IC50 725±n/a nM
Citation Sharma, VTepe, JJ Potent inhibition of checkpoint kinase activity by a hymenialdisine-derived indoloazepine. Bioorg Med Chem Lett14:4319-21 (2004) 
 
Serine/threonine-protein kinase Chk1
Name:Serine/threonine-protein kinase Chk1
Type:Enzyme Catalytic Domain
Mol. Mass.:54443.02
Organism:Homo sapiens (Human)
Description:gi_166295192
Residue:476
BDBM16591
NameBDBM16591
Synonyms:(4Z)-4-(2-amino-5-oxo-3,5-dihydro-4H-imidazol-4-ylidene)-4,5,6,7-tetrahydropyrrolo[2,3-c]azepin-8(1H)-one B722657K110 Debromohymenialdisine (DBH) NSC607174
TypeSmall organic molecule
Emp. Form.C11H11N5O2
Mol. Mass.245.2373
SMILESNC1=NC(=O)C(N1)=C1CCNC(=O)c2[nH]ccc12