Reaction Details
TargetProtein kinase C beta type
LigandBDBM7491
Substrate/Competitorn/a
Meas. Tech.ChEMBL_306362 (CHEMBL828239)
IC50 1200±n/a nM
Citation Sharma, VTepe, JJ Potent inhibition of checkpoint kinase activity by a hymenialdisine-derived indoloazepine. Bioorg Med Chem Lett14:4319-21 (2004) 
 
Protein kinase C beta type
Name:Protein kinase C beta type
Type:Enzyme
Mol. Mass.:76873.67
Organism:Homo sapiens (Human)
Description:The recombinant human PKC enzymes were produced using a baculovirus expression system in SF9 cells
Residue:671
BDBM7491
NameBDBM7491
Synonyms:(4Z)-4-(2-amino-5-oxo-3,5-dihydro-4H-imidazol-4-ylidene)-2-bromo-4,5,6,7-tetrahydropyrrolo[2,3-c]azepin-8(1H)-one (Z)-hymenialdisine 4-(2-Amino-4-oxo-2-imidazolidin-5-ylidene)-2-bromo-4,5,6,7-tetrahydropyrrolo[2,3-c]azepin-8-one 4-(2-amino-4-oxo-1H-imidazol-5(4H)-ylidene)-2-bromo-4,5,6,7-tetrahydropyrrolo[2,3-c]azepin-8(1H)-one 4-[2-Amino-5-oxo-3,5-dihydro-imidazol-(4Z)-ylidene]-2-bromo-4,5,6,7-tetrahydro-1H-pyrrolo[2,3-c]azepin-8-one Hymenialdisine | Hymenialdisine, 1
TypeSmall organic molecule
Emp. Form.C11H10BrN5O2
Mol. Mass.324.133
SMILESNC1=NC(=O)C(N1)=C1CCNC(=O)c2[nH]c(Br)cc12