Reaction Details
TargetGenome polyprotein
LigandBDBM50150599
Substrate/Competitorn/a
Meas. Tech.ChEMBL_302912 (CHEMBL830372)
Ki 30±n/a nM
Citation Sun, DXLiu, LHeinz, BKolykhalov, ALamar, JJohnson, RBWang, QMYip, YChen, SH P4 cap modified tetrapeptidyl alpha-ketoamides as potent HCV NS3 protease inhibitors. Bioorg Med Chem Lett14:4333-8 (2004) 
 
Genome polyprotein
Name:Genome polyprotein
Type:Protein
Mol. Mass.:67067.41
Organism:Hepatitis C virus
Description:A3EZI9
Residue:631
BDBM50150599
NameBDBM50150599
Synonyms:2-{(S)-2-[(S)-2-Cyclohexyl-2-(2-2H-tetrazol-5-yl-acetylamino)-acetylamino]-3,3-dimethyl-butyryl}-octahydro-cyclopenta[c]pyrrole-1-carboxylic acid (1-cyclopropylaminooxalyl-butyl)-amide | CHEMBL182854
TypeSmall organic molecule
Emp. Form.C34H53N9O6
Mol. Mass.683.8413
SMILESCCCC(NC(=O)[C@@H]1C2CCCC2CN1C(=O)[C@@H](NC(=O)[C@@H](NC(=O)Cc1nnn[nH]1)C1CCCCC1)C(C)(C)C)C(=O)C(=O)NC1CC1