Reaction Details
TargetGamma-secretase subunit APH-1A/Gamma-secretase subunit APH-1B/Gamma-secretase subunit PEN-2/Nicastrin/Presenilin-1/Presenilin-2
LigandBDBM50150690
Substrate/Competitorn/a
Meas. Tech.ChEMBL_305104 (CHEMBL832407)
IC50 360±n/a nM
Citation Bihel, FDas, CBowman, MJWolfe, MS Discovery of a Subnanomolar helical D-tridecapeptide inhibitor of gamma-secretase. J Med Chem47:3931-3 (2004) 
 
Gamma-secretase subunit APH-1A/Gamma-secretase subunit APH-1B/Gamma-secretase subunit PEN-2/Nicastrin/Presenilin-1/Presenilin-2
Name:Gamma-secretase subunit APH-1A/Gamma-secretase subunit APH-1B/Gamma-secretase subunit PEN-2/Nicastrin/Presenilin-1/Presenilin-2
Type:n/a
Mol. Mass.:n/a
Description:ASSAY_ID of EBI is 68900
Components:This complex has 6 components.
Component 1
Name:Gamma-secretase subunit APH-1B
Synonyms:APH-1b APH1B_HUMAN Gamma-secretase PSFL | Presenilin-stabilization factor-like
Type:PROTEIN
Mol. Mass.:28468.17
Organism:Homo sapiens (Human)
Description:EBI_10231
Residue:257
Component 2
Name:Presenilin-2
Synonyms:AD3LP AD5 Gamma-secretase PS2 PSN2_HUMAN Presenilin 2 Presenilin-2 CTF subunit STM-2 | STM2
Type:PROTEIN
Mol. Mass.:50116.65
Organism:Homo sapiens (Human)
Description:ChEMBL_855576
Residue:448
Component 3
Name:Gamma-secretase subunit APH-1A
Synonyms:APH-1a APH1A_HUMAN Gamma-Secretase Subunit APH-1A Presenilin-stabilization factor
Type:Enzyme subunit; multi-pass membrane protein
Mol. Mass.:28998.73
Organism:Homo sapiens (Human)
Description:n/a
Residue:265
Component 4
Name:Nicastrin
Synonyms:Gamma-secretase NCSTN Nicastrin
Type:PROTEIN
Mol. Mass.:78404.96
Organism:Homo sapiens (Human)
Description:EBI_10683
Residue:709
Component 5
Name:Presenilin-1
Synonyms:3.4.23.- Gamma-Secretase Subunit Presenilin-1 PS1 PSEN1 PSNL1 Presenilin-1 CTF12 Protein S182
Type:n/a
Mol. Mass.:52657.13
Organism:Homo sapiens (Human)
Description:P49768
Residue:467
Component 6
Name:Gamma-secretase subunit PEN-2
Synonyms:Gamma-Secretase Subunit PEN-2 PEN2 PSENEN | Presenilin enhancer protein 2
Type:Enzyme subunit; multi-pass membrane protein
Mol. Mass.:12031.98
Organism:Homo sapiens (Human)
Description:n/a
Residue:101
BDBM50150690
NameBDBM50150690
Synonyms:CHEMBL409305 | methyl 2-[(2S,3S)-2-[(2S)-2-{2-[(2S)-2-[(2S,3R)-3-(benzyloxy)-2-{2-[(2S,3S)-2-[(2S)-2-[(2S)-2-[2-(2-{[(tert-butoxy)carbonyl]amino}acetamido)-2-methylpropanamido]-3-methylbutanamido]-3-methylbutanamido]-3-methylpentanamido]-2-methylpropanamido}butanamido]-3-methylbutanamido]-2-methylpropanamido}-3-methylbutanamido]-3-methylpentanamido]-2-methylpropanoate
TypeSmall organic molecule
Emp. Form.C67H114N12O16
Mol. Mass.1343.6929
SMILESCC[C@H](C)[C@H](NC(=O)[C@@H](NC(=O)[C@@H](NC(=O)C(C)(C)NC(=O)CNC(=O)OC(C)(C)C)C(C)C)C(C)C)C(=O)NC(C)(C)C(=O)N[C@@H]([C@@H](C)OCc1ccccc1)C(=O)N[C@@H](C(C)C)C(=O)NC(C)(C)C(=O)N[C@@H](C(C)C)C(=O)N[C@@H]([C@@H](C)CC)C(=O)NC(C)(C)C(=O)OC