Reaction Details
TargetPolyunsaturated fatty acid lipoxygenase ALOX12
LigandBDBM50150778
Substrate/Competitorn/a
Meas. Tech.ChEMBL_305339 (CHEMBL833559)
IC50 2300±n/a nM
Citation Segraves, ENShah, RRSegraves, NLJohnson, TAWhitman, SSui, JKKenyon, VACichewicz, RHCrews, PHolman, TR Probing the activity differences of simple and complex brominated aryl compounds against 15-soybean, 15-human, and 12-human lipoxygenase. J Med Chem47:4060-5 (2004) 
 
Polyunsaturated fatty acid lipoxygenase ALOX12
Name:Polyunsaturated fatty acid lipoxygenase ALOX12
Type:Protein
Mol. Mass.:75689.18
Organism:Homo sapiens (Human)
Description:P18054
Residue:663
BDBM50150778
NameBDBM50150778
Synonyms:Bastadin-7 CHEMBL360190 polybrominated diphenyl ether derivative
TypeSmall organic molecule
Emp. Form.C34H26Br4N4O8
Mol. Mass.938.208
SMILESOc1c(Br)cc2CCNC(=O)C(Cc3ccc(Oc4cc(CC(N=O)C(=O)NC=Cc5ccc(Oc1c2)c(Br)c5)cc(Br)c4O)c(Br)c3)N=O