Reaction Details
TargetPolyunsaturated fatty acid lipoxygenase ALOX15
LigandBDBM50150791
Substrate/Competitorn/a
Meas. Tech.ChEMBL_305468 (CHEMBL831078)
IC50 800±n/a nM
Citation Segraves, ENShah, RRSegraves, NLJohnson, TAWhitman, SSui, JKKenyon, VACichewicz, RHCrews, PHolman, TR Probing the activity differences of simple and complex brominated aryl compounds against 15-soybean, 15-human, and 12-human lipoxygenase. J Med Chem47:4060-5 (2004) 
 
Polyunsaturated fatty acid lipoxygenase ALOX15
Name:Polyunsaturated fatty acid lipoxygenase ALOX15
Type:Protein
Mol. Mass.:74804.05
Organism:Homo sapiens (Human)
Description:n/a
Residue:662
BDBM50150791
NameBDBM50150791
Synonyms:3,6,8-Tribromo-dibenzo[1,4]dioxin-1-ol Spongiadioxin C
TypeSmall organic molecule
Emp. Form.C12H5Br3O3
Mol. Mass.436.878
SMILESOc1cc(Br)cc2Oc3c(Br)cc(Br)cc3Oc12