Reaction Details
TargetPolyunsaturated fatty acid lipoxygenase ALOX12
LigandBDBM50150794
Substrate/Competitorn/a
Meas. Tech.ChEMBL_305339 (CHEMBL833559)
IC50 400±n/a nM
Citation Segraves, ENShah, RRSegraves, NLJohnson, TAWhitman, SSui, JKKenyon, VACichewicz, RHCrews, PHolman, TR Probing the activity differences of simple and complex brominated aryl compounds against 15-soybean, 15-human, and 12-human lipoxygenase. J Med Chem47:4060-5 (2004) 
 
Polyunsaturated fatty acid lipoxygenase ALOX12
Name:Polyunsaturated fatty acid lipoxygenase ALOX12
Type:Protein
Mol. Mass.:75689.18
Organism:Homo sapiens (Human)
Description:P18054
Residue:663
BDBM50150794
NameBDBM50150794
Synonyms:CHEMBL186752 | N-[2-(3-Bromo-4-hydroxy-phenyl)-ethyl]-3-[3,5-dibromo-4-(3-bromo-5-{2-[2-((E)-3-bromo-4-hydroxy-phenyl)-vinylcarbamoyl]-2-hydroxyimino-ethyl}-2-hydroxy-phenoxy)-phenyl]-2-[(E)-hydroxyimino]-propionamide
TypeSmall organic molecule
Emp. Form.C34H27Br5N4O8
Mol. Mass.1019.12
SMILESOc1ccc(CCNC(=O)C(Cc2cc(Br)c(Oc3cc(CC(N=O)C(=O)NC=Cc4ccc(O)c(Br)c4)cc(Br)c3O)c(Br)c2)N=O)cc1Br