Reaction Details
TargetMelanocortin receptor 5
LigandBDBM50150833
Substrate/Competitorn/a
Meas. Tech.ChEMBL_303300 (CHEMBL827433)
IC50 380±n/a nM
Citation Chen, CYu, JFleck, BAHoare, SRSaunders, JFoster, AC Phenylguanidines as selective nonpeptide melanocortin-5 receptor antagonists. J Med Chem47:4083-8 (2004) 
 
Melanocortin receptor 5
Name:Melanocortin receptor 5
Type:Enzyme
Mol. Mass.:36612.92
Organism:Homo sapiens (Human)
Description:P33032
Residue:325
BDBM50150833
NameBDBM50150833
Synonyms:4-[((S)-N-Cyclohexyl-3-methyl-piperazine-1-carboximidoyl)-amino]-N-[2-(2,4-dichloro-phenyl)-ethyl]-benzamide | CHEMBL185455
TypeSmall organic molecule
Emp. Form.C27H35Cl2N5O
Mol. Mass.516.506
SMILESC[C@H]1CN(CCN1)C(Nc1ccc(cc1)C(=O)NCCc1ccc(Cl)cc1Cl)=NC1CCCCC1