Reaction Details
TargetPeroxisome proliferator-activated receptor gamma
LigandBDBM50145710
Substrate/Competitorn/a
Meas. Tech.ChEMBL_302951 (CHEMBL841786)
Ki 3±n/a nM
Citation Henke, BR Peroxisome proliferator-activated receptor alpha/gamma dual agonists for the treatment of type 2 diabetes. J Med Chem47:4118-27 (2004) 
 
Peroxisome proliferator-activated receptor gamma
Name:Peroxisome proliferator-activated receptor gamma
Type:Nuclear Receptor
Mol. Mass.:57613.46
Organism:Homo sapiens (Human)
Description:P37231
Residue:505
BDBM50145710
NameBDBM50145710
Synonyms:2-Methyl-3-{4-[2-(5-methyl-2-thiophen-2-yl-oxazol-4-yl)-ethoxy]-phenyl}-2-phenoxy-propionic acid | CHEMBL82602
TypeSmall organic molecule
Emp. Form.C26H25NO5S
Mol. Mass.463.545
SMILESCc1oc(nc1CCOc1ccc(CC(C)(Oc2ccccc2)C(O)=O)cc1)-c1cccs1