Reaction Details
TargetPeroxisome proliferator-activated receptor alpha
LigandBDBM50151001
Substrate/Competitorn/a
Meas. Tech.ChEMBL_302950 (CHEMBL841785)
Ki 2±n/a nM
Citation Henke, BR Peroxisome proliferator-activated receptor alpha/gamma dual agonists for the treatment of type 2 diabetes. J Med Chem47:4118-27 (2004) 
 
Peroxisome proliferator-activated receptor alpha
Name:Peroxisome proliferator-activated receptor alpha
Type:Enzyme
Mol. Mass.:52222.08
Organism:Homo sapiens (Human)
Description:Q07869
Residue:468
BDBM50151001
NameBDBM50151001
Synonyms:(S)-2-((Z)-1-Methyl-3-oxo-3-phenyl-propenylamino)-3-{4-[2-(5-methyl-2-phenyl-oxazol-4-yl)-ethoxy]-phenyl}-propionic acid | CHEMBL410478
TypeSmall organic molecule
Emp. Form.C31H30N2O5
Mol. Mass.510.5803
SMILESCC(CC(=O)c1ccccc1)=N[C@@H](Cc1ccc(OCCc2nc(oc2C)-c2ccccc2)cc1)C(O)=O