Reaction Details
TargetTyrosine-protein phosphatase non-receptor type 1
LigandBDBM50131550
Substrate/Competitorn/a
Meas. Tech.ChEMBL_302605 (CHEMBL838572)
Ki 2.4±n/a nM
Citation Hooft van Huijsduijnen, RSauer, WHBombrun, ASwinnen, D Prospects for inhibitors of protein tyrosine phosphatase 1B as antidiabetic drugs. J Med Chem47:4142-6 (2004) 
 
Tyrosine-protein phosphatase non-receptor type 1
Name:Tyrosine-protein phosphatase non-receptor type 1
Type:Protein phosphatase
Mol. Mass.:49963.76
Organism:Homo sapiens (Human)
Description:Human recombinant GST-fusion PTP1B (1-435).
Residue:435
BDBM50131550
NameBDBM50131550
Synonyms:(3S)-3-{[(1S)-1-carbamoyl-2-{4-[difluoro(phosphono)methyl]phenyl}ethyl]carbamoyl}-3-(2-{4-[difluoro(phosphono)methyl]phenyl}acetamido)propanoic acid CHEMBL326115 | N-{1-Carbamoyl-2-[4-(difluoro-phosphono-methyl)-phenyl]-ethyl}-3-{2-[4-(difluoro-phosphono-methyl)-phenyl]-acetylamino}-succinamic acid
TypeSmall organic molecule
Emp. Form.C23H25F4N3O11P2
Mol. Mass.657.3992
SMILESNC(=O)[C@H](Cc1ccc(cc1)C(F)(F)P(O)(O)=O)NC(=O)[C@H](CC(O)=O)NC(=O)Cc1ccc(cc1)C(F)(F)P(O)(O)=O