Reaction Details
TargetPoly [ADP-ribose] polymerase 1
LigandBDBM27712
Substrate/Competitorn/a
Meas. Tech.ChEMBL_306013 (CHEMBL833529)
IC50 1200±n/a nM
Citation Hattori, KKido, YYamamoto, HIshida, JKamijo, KMurano, KOhkubo, MKinoshita, TIwashita, AMihara, KYamazaki, SMatsuoka, NTeramura, YMiyake, H Rational approaches to discovery of orally active and brain-penetrable quinazolinone inhibitors of poly(ADP-ribose)polymerase. J Med Chem47:4151-4 (2004) 
 
Poly [ADP-ribose] polymerase 1
Name:Poly [ADP-ribose] polymerase 1
Type:n/a
Mol. Mass.:113114.22
Organism:Homo sapiens (Human)
Description:P09874
Residue:1014
BDBM27712
NameBDBM27712
Synonyms:5-chloro-2-methyl-3,4-dihydroquinazolin-4-one quinazolinone analogue, 18
TypeSmall organic molecule
Emp. Form.C9H7ClN2O
Mol. Mass.194.618
SMILESCc1nc2cccc(Cl)c2c(=O)[nH]1