Reaction Details
TargetD(4) dopamine receptor
LigandBDBM50151045
Substrate/Competitorn/a
Meas. Tech.ChEMBL_302620 (CHEMBL876688)
Ki 1428±n/a nM
Citation Wittig, TWDecker, MLehmann, J Dopamine/serotonin receptor ligands. 9. Oxygen-containing midsized heterocyclic ring systems and nonrigidized analogues. A step toward dopamine D5 receptor selectivity. J Med Chem47:4155-8 (2004) 
 
D(4) dopamine receptor
Name:D(4) dopamine receptor
Type:Enzyme
Mol. Mass.:48373.19
Organism:Homo sapiens (Human)
Description:P21917
Residue:419
BDBM50151045
NameBDBM50151045
Synonyms:1-[2-(2-Benzyl-phenoxy)-ethyl]-pyrrolidine | CHEMBL435505
TypeSmall organic molecule
Emp. Form.C19H23NO
Mol. Mass.281.392
SMILESC(CN1CCCC1)Oc1ccccc1Cc1ccccc1