Reaction Details
TargetD(1B) dopamine receptor
LigandBDBM50151040
Substrate/Competitorn/a
Meas. Tech.ChEMBL_302586 (CHEMBL839546)
Ki 113±n/a nM
Citation Wittig, TWDecker, MLehmann, J Dopamine/serotonin receptor ligands. 9. Oxygen-containing midsized heterocyclic ring systems and nonrigidized analogues. A step toward dopamine D5 receptor selectivity. J Med Chem47:4155-8 (2004) 
 
D(1B) dopamine receptor
Name:D(1B) dopamine receptor
Type:Protein
Mol. Mass.:52943.41
Organism:Homo sapiens (Human)
Description:P21918
Residue:477
BDBM50151040
NameBDBM50151040
Synonyms:1-[3-(2-Benzyl-phenoxy)-propyl]-pyrrolidine | CHEMBL187367
TypeSmall organic molecule
Emp. Form.C20H25NO
Mol. Mass.295.4186
SMILESC(COc1ccccc1Cc1ccccc1)CN1CCCC1