Reaction Details
TargetTubulin beta-1 chain
LigandBDBM50005480
Substrate/Competitorn/a
Meas. Tech.ChEMBL_304756 (CHEMBL876479)
IC50 2030±n/a nM
Citation Liou, JPChang, YLKuo, FMChang, CWTseng, HYWang, CCYang, YNChang, JYLee, SJHsieh, HP Concise synthesis and structure-activity relationships of combretastatin A-4 analogues, 1-aroylindoles and 3-aroylindoles, as novel classes of potent antitubulin agents. J Med Chem47:4247-57 (2004) 
 
Tubulin beta-1 chain
Name:Tubulin beta-1 chain
Type:PROTEIN
Mol. Mass.:50311.77
Organism:Homo sapiens (Human)
Description:ChEMBL_305173
Residue:451
BDBM50005480
NameBDBM50005480
Synonyms:(-)-combretastatin (Z)-5-(3,4,5-trimethoxystyryl)-2-methoxyphenol (combretastin A-4)2-Methoxy-5-[2-(3,4,5-trimethoxy-phenyl)-vinyl]-phenol 2-Methoxy-5-[(Z)-2-(3,4,5-trimethoxy-phenyl)-vinyl]-phenol 2-methoxy-5-(3,4,5-trimethoxystyryl)phenol 5-(3,4,5-trimethoxystyryl)-2-methoxyphenol CHEMBL67 Combrestatin A4 Combretastatin Combretastin A-4 combretastatin A-4, (CSA4) | combretastin A4
TypeSmall organic molecule
Emp. Form.C18H20O5
Mol. Mass.316.3484
SMILESCOc1ccc(\C=C/c2cc(OC)c(OC)c(OC)c2)cc1O