Reaction Details
TargetBifunctional dihydrofolate reductase-thymidylate synthase
LigandBDBM18782
Substrate/Competitorn/a
Meas. Tech.ChEMBL_302861 (CHEMBL828776)
Ki 0.770±n/a nM
Citation Parenti, MDPacchioni, SFerrari, AMRastelli, G Three-dimensional quantitative structure-activity relationship analysis of a set of Plasmodium falciparum dihydrofolate reductase inhibitors using a pharmacophore generation approach. J Med Chem47:4258-67 (2004) 
 
Bifunctional dihydrofolate reductase-thymidylate synthase
Name:Bifunctional dihydrofolate reductase-thymidylate synthase
Type:Enzyme
Mol. Mass.:71822.51
Organism:Plasmodium falciparum (isolate K1 / Thailand)
Description:The mutant clone was prepared by cassette mutagenesis using wildtype pfDHFR as a template, and expressed in E. coli.
Residue:608
BDBM18782
NameBDBM18782
Synonyms:5-(4-tert-butylphenyl)-6-ethylpyrimidine-2,4-diamine P23
TypeSmall organic molecule
Emp. Form.C16H22N4
Mol. Mass.270.3727
SMILESCCc1nc(N)nc(N)c1-c1ccc(cc1)C(C)(C)C