Reaction Details
TargetBifunctional dihydrofolate reductase-thymidylate synthase
LigandBDBM18783
Substrate/Competitorn/a
Meas. Tech.ChEMBL_302861 (CHEMBL828776)
Ki 0.790±n/a nM
Citation Parenti, MDPacchioni, SFerrari, AMRastelli, G Three-dimensional quantitative structure-activity relationship analysis of a set of Plasmodium falciparum dihydrofolate reductase inhibitors using a pharmacophore generation approach. J Med Chem47:4258-67 (2004) 
 
Bifunctional dihydrofolate reductase-thymidylate synthase
Name:Bifunctional dihydrofolate reductase-thymidylate synthase
Type:Enzyme
Mol. Mass.:71822.51
Organism:Plasmodium falciparum (isolate K1 / Thailand)
Description:The mutant clone was prepared by cassette mutagenesis using wildtype pfDHFR as a template, and expressed in E. coli.
Residue:608
BDBM18783
NameBDBM18783
Synonyms:5-(3,4-dichlorophenyl)-6-ethylpyrimidine-2,4-diamine P13
TypeSmall organic molecule
Emp. Form.C12H12Cl2N4
Mol. Mass.283.156
SMILESCCc1nc(N)nc(N)c1-c1ccc(Cl)c(Cl)c1