Reaction Details
TargetGrowth hormone secretagogue receptor type 1
LigandBDBM50151167
Substrate/Competitorn/a
Meas. Tech.ChEMBL_303373 (CHEMBL839691)
Ki 1290±n/a nM
Citation Shoda, MHarada, TKogami, YTsujita, RAkashi, HKouji, HStahura, FLXue, LBajorath, J Identification of structurally diverse growth hormone secretagogue agonists by virtual screening and structure-activity relationship analysis of 2-formylaminoacetamide derivatives. J Med Chem47:4286-90 (2004) 
 
Growth hormone secretagogue receptor type 1
Name:Growth hormone secretagogue receptor type 1
Type:Receptor
Mol. Mass.:41334.57
Organism:Homo sapiens (Human)
Description:Receptor binding studies use plasma membranes from LLC PK-1 cells transiently transfected with hGHSR1a.
Residue:366
BDBM50151167
NameBDBM50151167
Synonyms:5-Phenyl-1H-pyrrole-2-carboxylic acid [cyclohexylcarbamoyl-(4-fluoro-phenyl)-methyl]-(3-diethylamino-propyl)-amide | CHEMBL185876
TypeSmall organic molecule
Emp. Form.C32H41FN4O2
Mol. Mass.532.6919
SMILESCCN(CC)CCCN(C(C(=O)NC1CCCCC1)c1ccc(F)cc1)C(=O)c1ccc([nH]1)-c1ccccc1