Reaction Details
TargetGrowth hormone secretagogue receptor type 1
LigandBDBM50151170
Substrate/Competitorn/a
Meas. Tech.ChEMBL_303373 (CHEMBL839691)
Ki 2030±n/a nM
Citation Shoda, MHarada, TKogami, YTsujita, RAkashi, HKouji, HStahura, FLXue, LBajorath, J Identification of structurally diverse growth hormone secretagogue agonists by virtual screening and structure-activity relationship analysis of 2-formylaminoacetamide derivatives. J Med Chem47:4286-90 (2004) 
 
Growth hormone secretagogue receptor type 1
Name:Growth hormone secretagogue receptor type 1
Type:Receptor
Mol. Mass.:41334.57
Organism:Homo sapiens (Human)
Description:Receptor binding studies use plasma membranes from LLC PK-1 cells transiently transfected with hGHSR1a.
Residue:366
BDBM50151170
NameBDBM50151170
Synonyms:CHEMBL185887 | N-[Cyclohexylcarbamoyl-(4-fluoro-phenyl)-methyl]-N-(3-diethylamino-propyl)-3-(3,4-dihydro-2H-quinolin-1-yl)-propionamide
TypeSmall organic molecule
Emp. Form.C33H47FN4O2
Mol. Mass.550.7503
SMILESCCN(CC)CCCN(C(C(=O)NC1CCCCC1)c1ccc(F)cc1)C(=O)CCN1CCCc2ccccc12