Reaction Details
TargetAdenosine receptor A2a
LigandBDBM50151188
Substrate/Competitorn/a
Meas. Tech.ChEMBL_303190 (CHEMBL829684)
Ki 14±n/a nM
Citation Vu, CBPeng, BKumaravel, GSmits, GJin, XPhadke, DEngber, THuang, CReilly, JTam, SGrant, DHetu, GChen, LZhang, JPetter, RC Piperazine derivatives of [1,2,4]triazolo[1,5-a][1,3,5]triazine as potent and selective adenosine A2a receptor antagonists. J Med Chem47:4291-9 (2004) 
 
Adenosine receptor A2a
Name:Adenosine receptor A2a
Type:G Protein-Coupled Receptor (GPCR)
Mol. Mass.:45015.65
Organism:Rattus norvegicus (rat)
Description:Rat A2A receptors expressed in CHO cells.
Residue:410
BDBM50151188
NameBDBM50151188
Synonyms:5-(4-((5-chloro-1-methyl-3-(trifluoromethyl)-1H-pyrazol-4-yl)methyl)piperazin-1-yl)-2-(furan-2-yl)-[1,2,4]triazolo[1,5-a][1,3,5]triazin-7-amine CHEMBL189192
TypeSmall organic molecule
Emp. Form.C18H18ClF3N10O
Mol. Mass.482.85
SMILESCn1nc(c(CN2CCN(CC2)c2nc(N)n3nc(nc3n2)-c2ccco2)c1Cl)C(F)(F)F